问题: 采用把原来的磁盘做成镜像,迁移后发现 caddy 都正常,个别 docker 网站提示 502 &nb… Read More
问题:
1 2 3 4 5 6 7 8 9 10 11 12 13 14 |
[WARNING] The POM for io.quarkus:quarkus-resteasy-qute-deployment:jar:1.13.0.Final is missing, no dependency information available [INFO] ------------------------------------------------------------------------ [INFO] BUILD FAILURE [INFO] ------------------------------------------------------------------------ [INFO] Total time: 50.125 s [INFO] Finished at: 2021-04-02T10:24:28+08:00 [INFO] ------------------------------------------------------------------------ [ERROR] Failed to execute goal io.quarkus:quarkus-maven-plugin:1.13.0.Final:generate-code (default) on project site: Quarkus code generation phase has failed: Failed to bootstrap the application: Failed to create the application model for idevbox:site::jar:1.0.0-SNAPSHOT: Failed to inject extension deployment dependencies for idevbox:site:jar:1.0.0-SNAPSHOT: No dependencies collected for Quarkus extension deployment artifact io.quarkus:quarkus-resteasy-qute-deployment:jar:1.13.0.Final while at least the corresponding runtime artifact io.quarkus:quarkus-resteasy-qute:jar:1.13.0.Final is expected -> [Help 1] [ERROR] [ERROR] To see the full stack trace of the errors, re-run Maven with the -e switch. [ERROR] Re-run Maven using the -X switch to enable full debug logging. [ERROR] [ERROR] For more information about the errors and possible solutions, please read the following articles: [ERROR] [Help 1] http://cwiki.apache.org/confluence/display/MAVEN/MojoExecutionException |
&nbs… Read More
问题:
1 |
DEBUG [org.apa.htt.imp.con.PoolingHttpClientConnectionManager] (Connection evictor) Closing expired connections |
&nbs… Read More